{"text_format":"1","workbook":"xlsx","n_sheets":14,"sheets":["Solicitud ampliada","Datos entrada","Presupuesto","Nota informativa","Solicitud nivel 1","Solicitud","Tarificador","Tasas reaseguro","Tasas directo","Tasas imp.incl. Asisa VRT","Prima 50.000 €","Prima 100.000 €","Prima 150.000 €","Recargos por fracc"],"not_rendered":{"charts":0,"images":12,"macros":1,"external_links":0,"defined_names":53,"comments":0,"pivot_tables":0},"unopened":[],"bounds":{"document_bytes":16777216,"sheet_cells":100000,"rows_first":2000,"rows_last":500,"rows_between":2000,"halvings":0,"cell_chars":16384,"cell_head_chars":4096},"cells_cut":0,"cells_raw":0,"read":"whole","date_system":"1900"}

{"sheet":"Solicitud ampliada","index":0,"n_rows":0,"n_cols":0,"rows_kept":0,"cut":false,"hidden":true,"merged":[]}

{"sheet":"Datos entrada","index":1,"n_rows":101,"n_cols":20,"rows_kept":101,"cut":false,"hidden":false,"merged":[[7,0,7,1],[25,0,25,1],[26,0,26,1],[31,0,31,1],[23,0,23,1],[18,0,18,1],[10,0,10,1],[11,0,11,1],[13,0,13,1],[14,0,14,1],[16,0,16,1],[19,0,19,1],[20,0,20,1]]}
[null,null,null,null,null,null,null,null,null,null,null,null,null,"PROFESIÓN",null,"MUERTE","IPA","COMPLEMENTARIOS ACC.","DEPORTE","REGLAS DE SUSCRIPCION PARA TODAS LAS GARANTÍAS"]
[null,null,null,null,null,null,null,null,null,null,null,null,null,"ABOGADO/A",{"$f":"LOWER(N2)","v":"abogado/a"},"-","-","-","Sin práctica deportiva/ocio de riesgo","Sin recargo"]
[null,null,null,null,null,null,null,null,null,null,null,null,null,"ADMINISTRATIVO/A",{"$f":"LOWER(N3)","v":"administrativo/a"},"-","-","-","Deporte Profesional","Retenido"]
[null,null,null,null,null,null,null,null,null,null,null,null,null,"AGENTE COMERCIAL","agente comercial","-","-","-","Aerobic","Sin recargo"]
[null,null,null,null,null,null,null,null,null,null,null,null,null,"AGENTE DE SEGUROS","agente de seguros","-","-","-","Ala Delta","Retenido"]
[null,null,null,null,null,null,null,null,null,null,null,null,null,"AGENTE DE VIAJES","agente de viajes","-","-","-","Artes marciales","Sin recargo"]
[null,null,null,null,null,null,null,null,null,null,null,null,null,"AGRICULTOR","agricultor","-",1,0.5,"Atletismo","Sin recargo"]
["Tarificador Seguro Asisa Vida Tranquilidad",null,null,null,null,null,null,null,null,null,null,null,null,"ALBAÑIL","albañil","-",1,1,"Bádminton","Sin recargo"]
[null,null,null,null,null,null,null,null,null,"Anual",null,null,null,"AMA/O DE CASA ","ama/o de casa ","-","-","-","Baloncesto","Sin recargo"]
[null,null,null,null,null,null,null,null,null,"Semestral",null,null,null,"ANDAMIAJE (Colocación alturas)","andamiaje (colocación alturas)","Retenido","Retenido","Retenido","Béisbol","Sin recargo"]
["Datos de entrada del asegurado",140000,null,null,null,null,null,null,null,"Trimestral",null,null,null,"ARQUITECTO/A","arquitecto/a","-","-","-","Biatlón/Triatlón/Pentatlón","Retenido"]
["Fecha efecto",140000,"2017-01-01",null,null,null,null,null,null,"Mensual",null,null,null,"ARQUITECTO/A TECNICO","arquitecto/a tecnico","Retenido","Retenido","Retenido","Bolos","Sin recargo"]
["(fecha en que tomará efecto la póliza en Asisa Vida)",null,null,null,null,null,null,"Si",null,null,null,null,null,"ASESOR/A FISCAL","asesor/a fiscal","-","-","-","Bouldering (escalada en roca sin protección)","Retenido"]
["Fecha de nacimiento",39,"1977-01-01",null,null,null,null,"No","Hombre",null,null,null,null,"AUXILIAR ADMINISTRATIVO","auxiliar administrativo","-","-","-","Boxeo","Retenido"]
["Nombre y apellidos",null,"xxxxx",null,null,null,null,null,"Mujer",null,null,null,null,"AUXILIAR DE CLÍNICA","auxiliar de clínica","-","-","-","Buceo deportivo","Retenido"]
{"$rows_left_out":87}
{"sheet":"Presupuesto","index":2,"n_rows":54,"n_cols":7,"rows_kept":54,"cut":false,"hidden":true,"merged":[[25,1,25,2],[22,1,22,3],[23,2,23,3],[24,1,24,2],[45,1,45,3],[46,1,46,3],[47,1,47,3],[26,1,26,2],[29,1,29,2],[32,1,32,3],[33,1,34,1],[33,2,34,2],[33,3,34,3],[27,1,27,2],[28,1,28,2]]}
[]
[]
[]
[]
[]
[]
[]
[]
[]
[]
[]
[null,"Presupuesto Seguro Asisa Vida Tranquilidad"]
[]
[]
[]
{"$rows_left_out":40}
{"sheet":"Nota informativa","index":3,"n_rows":0,"n_cols":0,"rows_kept":0,"cut":false,"hidden":true,"merged":[]}

{"sheet":"Solicitud nivel 1","index":4,"n_rows":0,"n_cols":0,"rows_kept":0,"cut":false,"hidden":true,"merged":[]}

{"sheet":"Solicitud","index":5,"n_rows":0,"n_cols":0,"rows_kept":0,"cut":false,"hidden":true,"merged":[]}

{"sheet":"Tarificador","index":6,"n_rows":23,"n_cols":18,"rows_kept":23,"cut":false,"hidden":true,"merged":[]}
["Tarificador seguro ASISA VIDA TRANQUILIDAD"]
[]
[]
[null,null,null,"PRIMA ANUAL ",{"$f":"R23","v":135.08763830469866},null,null,null,null,null,"Ref.","Versión"]
["Edad:",{"$f":"'Datos entrada'!K16","v":40},null,"Prima anual sin consorcio",null,null,{"$f":"IF(B7=\"Anual\",\"-\",H23+I23+J23+K23+L23)","v":"-"},null,{"$f":"'Datos entrada'!C20","v":"Sin práctica deportiva/ocio de riesgo"},{"$f":"VLOOKUP(Tarificador!I5,'Datos entrada'!S2:T69,2,0)","v":"Sin recargo"}]
[null,null,null,"Importe por recibo",null,null,{"$f":"IF(B7=\"Anual\",\"-\",IF(B7=\"Anual\",(H23+I23+J23)/1,IF(B7=\"Semestral\",(H23+I23+J23)/2,IF(B7=\"Trimestral\",(H23+I23+J23)/4,(H23+I23+J23)/12))))","v":"-"},null,{"$f":"'Datos entrada'!C21","v":"traductor/a"},{"$f":"VLOOKUP(Tarificador!I6,'Datos entrada'!O2:R100,2,0)","v":"-"},{"$f":"VLOOKUP(Tarificador!I6,'Datos entrada'!O2:R100,3,0)","v":"-"},{"$f":"VLOOKUP(Tarificador!I6,'Datos entrada'!O2:R100,4,0)","v":"-"}]
["Periodicidad",{"$f":"'Datos entrada'!C32","v":"Anual"},null,"Importe primer recibo",null,null,{"$f":"IF(B7=\"Anual\",\"-\",G6+L23+K23)","v":"-"},null,null,{"$f":"IF(J6=\"Retenido\",\"No\",\"Si\")","v":"Si"},{"$f":"IF(K6=\"Retenido\",\"No\",\"Si\")","v":"Si"},"Si"]
[null,null,null,null,null,null,null,null,null,{"$f":"IF(J7=\"Si\",IF(J6=\"-\",0,J6),\"\")","v":0},{"$f":"IF(K7=\"Si\",IF(K6=\"-\",0,K6),\"\")","v":0},0]
["Capital",{"$f":"'Datos entrada'!C19","v":100000},null,null,null,null,null,null,null,null,{"$f":"IF(K6=\"Retenido\",\"-\",K6)","v":"-"},{"$f":"IF(L6=\"Retenido\",\"-\",L6)","v":"-"}]
[]
["Gastos internos",0.05]
["Gastos externos",0.2]
[null,null,null,null,null,null,null,null,"Recargo",null,null,null,null,null,"Garantias","Prima total",null,"Prima total"]
[null,"Tipo garantía",null,"Prima Pura","Gastos interno","Gasto fijo","Gastos externos","Prima comercial neta","Fracci.","IPS","CLEA","Consorcio","IVA","Prima total","Seleccionadas","neta","Solo Impuestos","primera anualidad"]
["Fallecimiento","Obligatoria",null,{"$f":"VLOOKUP($B$5,'Tasas directo'!$A$4:$F$79,3,0)/1000*$B$9*(1+J8)","v":75.793162517865639},{"$f":"D15*B11","v":3.7896581258932822},0,{"$f":"H15-D15-E15-F15","v":19.895705160939727},{"$f":"(D15*(1+B11)/(1-B12)+F15)","v":99.478525804698648},{"$f":"VLOOKUP($B$7,'Recargos por fracc'!$A$1:$B$4,2,0)*H15","v":0},null,null,{"$f":"($B$9/1000)*0.005","v":0.5},null,{"$f":"SUM(H15:M15)","v":99.978525804698648},"Si",{"$f":"IF(O15=\"Si\",H15+I15,0)","v":99.478525804698648},{"$f":"IF(O15=\"Si\",SUM(J15:M15),0)","v":0.5},{"$f":"IF(O15=\"Si\",N15,0)","v":99.978525804698648}]
{"$rows_left_out":9}
{"sheet":"Tasas reaseguro","index":7,"n_rows":79,"n_cols":6,"rows_kept":79,"cut":false,"hidden":true,"merged":[[1,0,1,1]]}
[]
["Pasem 2010 Ponderadas por salud",null,"Tasa reaseguro Fallecimiento por cualquier causa 65% tabla anterior","Tasa reaseguro IPA por cualquier causa","Tasa reaseguro Fallecimiento por accidente","Tasa reaseguro IPA por accidente"]
["Edad","Tasas en ‰","Tasas en ‰","Tasas en ‰","Tasas en ‰","Tasas en ‰"]
[0,5.2874007339221292,{"$f":"B4*65%","v":3.4368104770493839}]
[1,0.39745844799119434,{"$f":"B5*65%","v":0.25834799119427632}]
[2,0.32905938198064039,0.21388859828741627]
[3,0.26674916820702399,0.1733869593345656]
[4,0.21608315987709387,0.14045405392011101]
[5,0.17960632098765433,0.11674410864197532]
[6,0.15557396975985768,0.1011230803439075]
[7,0.14243507605520297,9.2582799435881935E-2]
[8,0.13714794193676674,8.914616225889839E-2]
[9,0.13792976863753215,8.9654349614395903E-2]
[10,0.14702631839319283,9.556710695557534E-2]
[11,0.16433448889721727,0.10681741778319123]
{"$rows_left_out":65}
{"sheet":"Tasas directo","index":8,"n_rows":79,"n_cols":6,"rows_kept":79,"cut":false,"hidden":true,"merged":[[1,0,1,1]]}
[]
["Pasem 2010 Ponderadas por salud",null,"Tasa directo Fallecimiento por cualquier causa 65% tabla anterior","Tasa directo IPA por cualquier causa","Tasa directo Fallecimiento por accidente","Tasa directo IPA por accidente"]
["Edad","Tasas en ‰","Tasas en ‰","Tasas en ‰","Tasas en ‰","Tasas en ‰"]
[0,5.2874007339221292,{"$f":"B4*65%","v":3.4368104770493839}]
[1,0.39745844799119434,{"$f":"B5*65%","v":0.25834799119427632}]
[2,0.32905938198064039,0.21388859828741627]
[3,0.26674916820702399,0.1733869593345656]
[4,0.21608315987709387,0.14045405392011101]
[5,0.17960632098765433,0.11674410864197532]
[6,0.15557396975985768,0.1011230803439075]
[7,0.14243507605520297,9.2582799435881935E-2]
[8,0.13714794193676674,8.914616225889839E-2]
[9,0.13792976863753215,8.9654349614395903E-2]
[10,0.14702631839319283,9.556710695557534E-2]
[11,0.16433448889721727,0.10681741778319123]
{"$rows_left_out":65}
{"sheet":"Tasas imp.incl. Asisa VRT","index":9,"n_rows":67,"n_cols":5,"rows_kept":67,"cut":false,"hidden":true,"merged":[[0,0,0,4]]}
["Tasas seguro Asisa Vida Riesgo Tradicional (impuestos incluidos)"]
["(*) Las garantías complementarias de accidentes incluyen el Consorcio"]
[]
[null,"Tasas Fallecimiento por cualquier causa","Tasa IPA por cualquier causa","Tasa Fallecimiento por accidente","Tasa IPA por accidente"]
["Edad","Tasas en ‰","Tasas en ‰","Tasas en ‰","Tasas en ‰"]
[14,0.25323782605542666]
[15,0.31201323755377997]
[16,0.3790131752390799]
[17,0.44245666426437169]
[18,0.44724697787747525,0.29257593750000005,0.49262656250000003,0.49262656250000003]
[19,0.45886948595643634,0.29257593750000005,0.49262656250000003,0.49262656250000003]
[20,0.46871414440524189,0.29257593750000005,0.49262656250000003,0.49262656250000003]
[21,0.48220890185502036,0.29257593750000005,0.49262656250000003,0.49262656250000003]
[22,0.49399218660867089,0.29257593750000005,0.49262656250000003,0.49262656250000003]
[23,0.50543844879891042,0.29257593750000005,0.49262656250000003,0.49262656250000003]
{"$rows_left_out":53}
{"sheet":"Prima 50.000 €","index":10,"n_rows":66,"n_cols":5,"rows_kept":66,"cut":false,"hidden":true,"merged":[[0,0,0,4],[1,0,1,4]]}
["Prima Asisa Vida Tranquilidad (impuestos incluidos)"]
["Capital: 50.000 € (forma pago anual)"]
[]
["Edad","Prima Fallecimiento por cualquier causa","Prima IPA por cualquier causa","Prima Fallecimiento por accidente","Prima IPA por accidente"]
[18,{"$f":"'Tasas imp.incl. Asisa VRT'!B10*50000/1000","v":22.362348893873762},{"$f":"'Tasas imp.incl. Asisa VRT'!C10*50000/1000","v":14.628796875000003},{"$f":"'Tasas imp.incl. Asisa VRT'!D10*50000/1000","v":24.631328125},{"$f":"'Tasas imp.incl. Asisa VRT'!E10*50000/1000","v":24.631328125}]
[19,{"$f":"'Tasas imp.incl. Asisa VRT'!B11*50000/1000","v":22.943474297821815},{"$f":"'Tasas imp.incl. Asisa VRT'!C11*50000/1000","v":14.628796875000003},{"$f":"'Tasas imp.incl. Asisa VRT'!D11*50000/1000","v":24.631328125},{"$f":"'Tasas imp.incl. Asisa VRT'!E11*50000/1000","v":24.631328125}]
[20,{"$f":"'Tasas imp.incl. Asisa VRT'!B12*50000/1000","v":23.435707220262096},{"$f":"'Tasas imp.incl. Asisa VRT'!C12*50000/1000","v":14.628796875000003},{"$f":"'Tasas imp.incl. Asisa VRT'!D12*50000/1000","v":24.631328125},{"$f":"'Tasas imp.incl. Asisa VRT'!E12*50000/1000","v":24.631328125}]
[21,{"$f":"'Tasas imp.incl. Asisa VRT'!B13*50000/1000","v":24.110445092751018},{"$f":"'Tasas imp.incl. Asisa VRT'!C13*50000/1000","v":14.628796875000003},{"$f":"'Tasas imp.incl. Asisa VRT'!D13*50000/1000","v":24.631328125},{"$f":"'Tasas imp.incl. Asisa VRT'!E13*50000/1000","v":24.631328125}]
[22,{"$f":"'Tasas imp.incl. Asisa VRT'!B14*50000/1000","v":24.699609330433546},{"$f":"'Tasas imp.incl. Asisa VRT'!C14*50000/1000","v":14.628796875000003},{"$f":"'Tasas imp.incl. Asisa VRT'!D14*50000/1000","v":24.631328125},{"$f":"'Tasas imp.incl. Asisa VRT'!E14*50000/1000","v":24.631328125}]
[23,{"$f":"'Tasas imp.incl. Asisa VRT'!B15*50000/1000","v":25.27192243994552},{"$f":"'Tasas imp.incl. Asisa VRT'!C15*50000/1000","v":14.628796875000003},{"$f":"'Tasas imp.incl. Asisa VRT'!D15*50000/1000","v":24.631328125},{"$f":"'Tasas imp.incl. Asisa VRT'!E15*50000/1000","v":24.631328125}]
[24,{"$f":"'Tasas imp.incl. Asisa VRT'!B16*50000/1000","v":25.714278165706414},{"$f":"'Tasas imp.incl. Asisa VRT'!C16*50000/1000","v":14.628796875000003},{"$f":"'Tasas imp.incl. Asisa VRT'!D16*50000/1000","v":24.631328125},{"$f":"'Tasas imp.incl. Asisa VRT'!E16*50000/1000","v":24.631328125}]
[25,{"$f":"'Tasas imp.incl. Asisa VRT'!B17*50000/1000","v":25.646445215520938},{"$f":"'Tasas imp.incl. Asisa VRT'!C17*50000/1000","v":14.628796875000003},{"$f":"'Tasas imp.incl. Asisa VRT'!D17*50000/1000","v":24.631328125},{"$f":"'Tasas imp.incl. Asisa VRT'!E17*50000/1000","v":24.631328125}]
[26,{"$f":"'Tasas imp.incl. Asisa VRT'!B18*50000/1000","v":24.999718860684769},{"$f":"'Tasas imp.incl. Asisa VRT'!C18*50000/1000","v":14.628796875000003},{"$f":"'Tasas imp.incl. Asisa VRT'!D18*50000/1000","v":24.631328125},{"$f":"'Tasas imp.incl. Asisa VRT'!E18*50000/1000","v":24.631328125}]
[27,{"$f":"'Tasas imp.incl. Asisa VRT'!B19*50000/1000","v":24.299228612499995},{"$f":"'Tasas imp.incl. Asisa VRT'!C19*50000/1000","v":14.628796875000003},{"$f":"'Tasas imp.incl. Asisa VRT'!D19*50000/1000","v":24.631328125},{"$f":"'Tasas imp.incl. Asisa VRT'!E19*50000/1000","v":24.631328125}]
[28,{"$f":"'Tasas imp.incl. Asisa VRT'!B20*50000/1000","v":23.427245204922848},{"$f":"'Tasas imp.incl. Asisa VRT'!C20*50000/1000","v":14.628796875000003},{"$f":"'Tasas imp.incl. Asisa VRT'!D20*50000/1000","v":24.631328125},{"$f":"'Tasas imp.incl. Asisa VRT'!E20*50000/1000","v":24.631328125}]
{"$rows_left_out":52}
{"sheet":"Prima 100.000 €","index":11,"n_rows":66,"n_cols":5,"rows_kept":66,"cut":false,"hidden":true,"merged":[[0,0,0,4],[1,0,1,4]]}
["Prima Asisa Vida Tranquilidad (impuestos incluidos)**"]
["Capital: 100.000 € (forma pago anual)"]
[]
["Edad","Prima Fallecimiento por cualquier causa","Prima IPA por cualquier causa","Prima Fallecimiento por accidente","Prima IPA por accidente"]
[18,{"$f":"'Tasas imp.incl. Asisa VRT'!B10*100000/1000","v":44.724697787747523},{"$f":"'Tasas imp.incl. Asisa VRT'!C10*100000/1000","v":29.257593750000005},{"$f":"'Tasas imp.incl. Asisa VRT'!D10*100000/1000","v":49.262656249999999},{"$f":"'Tasas imp.incl. Asisa VRT'!E10*100000/1000","v":49.262656249999999}]
[19,{"$f":"'Tasas imp.incl. Asisa VRT'!B11*100000/1000","v":45.886948595643631},{"$f":"'Tasas imp.incl. Asisa VRT'!C11*100000/1000","v":29.257593750000005},{"$f":"'Tasas imp.incl. Asisa VRT'!D11*100000/1000","v":49.262656249999999},{"$f":"'Tasas imp.incl. Asisa VRT'!E11*100000/1000","v":49.262656249999999}]
[20,{"$f":"'Tasas imp.incl. Asisa VRT'!B12*100000/1000","v":46.871414440524191},{"$f":"'Tasas imp.incl. Asisa VRT'!C12*100000/1000","v":29.257593750000005},{"$f":"'Tasas imp.incl. Asisa VRT'!D12*100000/1000","v":49.262656249999999},{"$f":"'Tasas imp.incl. Asisa VRT'!E12*100000/1000","v":49.262656249999999}]
[21,{"$f":"'Tasas imp.incl. Asisa VRT'!B13*100000/1000","v":48.220890185502036},{"$f":"'Tasas imp.incl. Asisa VRT'!C13*100000/1000","v":29.257593750000005},{"$f":"'Tasas imp.incl. Asisa VRT'!D13*100000/1000","v":49.262656249999999},{"$f":"'Tasas imp.incl. Asisa VRT'!E13*100000/1000","v":49.262656249999999}]
[22,{"$f":"'Tasas imp.incl. Asisa VRT'!B14*100000/1000","v":49.399218660867092},{"$f":"'Tasas imp.incl. Asisa VRT'!C14*100000/1000","v":29.257593750000005},{"$f":"'Tasas imp.incl. Asisa VRT'!D14*100000/1000","v":49.262656249999999},{"$f":"'Tasas imp.incl. Asisa VRT'!E14*100000/1000","v":49.262656249999999}]
[23,{"$f":"'Tasas imp.incl. Asisa VRT'!B15*100000/1000","v":50.54384487989104},{"$f":"'Tasas imp.incl. Asisa VRT'!C15*100000/1000","v":29.257593750000005},{"$f":"'Tasas imp.incl. Asisa VRT'!D15*100000/1000","v":49.262656249999999},{"$f":"'Tasas imp.incl. Asisa VRT'!E15*100000/1000","v":49.262656249999999}]
[24,{"$f":"'Tasas imp.incl. Asisa VRT'!B16*100000/1000","v":51.428556331412828},{"$f":"'Tasas imp.incl. Asisa VRT'!C16*100000/1000","v":29.257593750000005},{"$f":"'Tasas imp.incl. Asisa VRT'!D16*100000/1000","v":49.262656249999999},{"$f":"'Tasas imp.incl. Asisa VRT'!E16*100000/1000","v":49.262656249999999}]
[25,{"$f":"'Tasas imp.incl. Asisa VRT'!B17*100000/1000","v":51.292890431041876},{"$f":"'Tasas imp.incl. Asisa VRT'!C17*100000/1000","v":29.257593750000005},{"$f":"'Tasas imp.incl. Asisa VRT'!D17*100000/1000","v":49.262656249999999},{"$f":"'Tasas imp.incl. Asisa VRT'!E17*100000/1000","v":49.262656249999999}]
[26,{"$f":"'Tasas imp.incl. Asisa VRT'!B18*100000/1000","v":49.999437721369539},{"$f":"'Tasas imp.incl. Asisa VRT'!C18*100000/1000","v":29.257593750000005},{"$f":"'Tasas imp.incl. Asisa VRT'!D18*100000/1000","v":49.262656249999999},{"$f":"'Tasas imp.incl. Asisa VRT'!E18*100000/1000","v":49.262656249999999}]
[27,{"$f":"'Tasas imp.incl. Asisa VRT'!B19*100000/1000","v":48.59845722499999},{"$f":"'Tasas imp.incl. Asisa VRT'!C19*100000/1000","v":29.257593750000005},{"$f":"'Tasas imp.incl. Asisa VRT'!D19*100000/1000","v":49.262656249999999},{"$f":"'Tasas imp.incl. Asisa VRT'!E19*100000/1000","v":49.262656249999999}]
[28,{"$f":"'Tasas imp.incl. Asisa VRT'!B20*100000/1000","v":46.854490409845695},{"$f":"'Tasas imp.incl. Asisa VRT'!C20*100000/1000","v":29.257593750000005},{"$f":"'Tasas imp.incl. Asisa VRT'!D20*100000/1000","v":49.262656249999999},{"$f":"'Tasas imp.incl. Asisa VRT'!E20*100000/1000","v":49.262656249999999}]
{"$rows_left_out":52}
{"sheet":"Prima 150.000 €","index":12,"n_rows":66,"n_cols":5,"rows_kept":66,"cut":false,"hidden":true,"merged":[[0,0,0,4],[1,0,1,4]]}
["Prima Asisa Vida Tranquilidad (impuestos incluidos)**"]
["Capital: 150.000 € (forma pago anual)"]
[]
["Edad","Prima Fallecimiento por cualquier causa","Prima IPA por cualquier causa","Prima Fallecimiento por accidente","Prima IPA por accidente"]
[18,{"$f":"'Tasas imp.incl. Asisa VRT'!B10*150000/1000","v":67.087046681621288},{"$f":"'Tasas imp.incl. Asisa VRT'!C10*150000/1000","v":43.886390625000004},{"$f":"'Tasas imp.incl. Asisa VRT'!D10*150000/1000","v":73.893984375000002},{"$f":"'Tasas imp.incl. Asisa VRT'!E10*150000/1000","v":73.893984375000002}]
[19,{"$f":"'Tasas imp.incl. Asisa VRT'!B11*150000/1000","v":68.830422893465453},{"$f":"'Tasas imp.incl. Asisa VRT'!C11*150000/1000","v":43.886390625000004},{"$f":"'Tasas imp.incl. Asisa VRT'!D11*150000/1000","v":73.893984375000002},{"$f":"'Tasas imp.incl. Asisa VRT'!E11*150000/1000","v":73.893984375000002}]
[20,{"$f":"'Tasas imp.incl. Asisa VRT'!B12*150000/1000","v":70.307121660786294},{"$f":"'Tasas imp.incl. Asisa VRT'!C12*150000/1000","v":43.886390625000004},{"$f":"'Tasas imp.incl. Asisa VRT'!D12*150000/1000","v":73.893984375000002},{"$f":"'Tasas imp.incl. Asisa VRT'!E12*150000/1000","v":73.893984375000002}]
[21,{"$f":"'Tasas imp.incl. Asisa VRT'!B13*150000/1000","v":72.33133527825305},{"$f":"'Tasas imp.incl. Asisa VRT'!C13*150000/1000","v":43.886390625000004},{"$f":"'Tasas imp.incl. Asisa VRT'!D13*150000/1000","v":73.893984375000002},{"$f":"'Tasas imp.incl. Asisa VRT'!E13*150000/1000","v":73.893984375000002}]
[22,{"$f":"'Tasas imp.incl. Asisa VRT'!B14*150000/1000","v":74.098827991300638},{"$f":"'Tasas imp.incl. Asisa VRT'!C14*150000/1000","v":43.886390625000004},{"$f":"'Tasas imp.incl. Asisa VRT'!D14*150000/1000","v":73.893984375000002},{"$f":"'Tasas imp.incl. Asisa VRT'!E14*150000/1000","v":73.893984375000002}]
[23,{"$f":"'Tasas imp.incl. Asisa VRT'!B15*150000/1000","v":75.815767319836567},{"$f":"'Tasas imp.incl. Asisa VRT'!C15*150000/1000","v":43.886390625000004},{"$f":"'Tasas imp.incl. Asisa VRT'!D15*150000/1000","v":73.893984375000002},{"$f":"'Tasas imp.incl. Asisa VRT'!E15*150000/1000","v":73.893984375000002}]
[24,{"$f":"'Tasas imp.incl. Asisa VRT'!B16*150000/1000","v":77.142834497119253},{"$f":"'Tasas imp.incl. Asisa VRT'!C16*150000/1000","v":43.886390625000004},{"$f":"'Tasas imp.incl. Asisa VRT'!D16*150000/1000","v":73.893984375000002},{"$f":"'Tasas imp.incl. Asisa VRT'!E16*150000/1000","v":73.893984375000002}]
[25,{"$f":"'Tasas imp.incl. Asisa VRT'!B17*150000/1000","v":76.939335646562796},{"$f":"'Tasas imp.incl. Asisa VRT'!C17*150000/1000","v":43.886390625000004},{"$f":"'Tasas imp.incl. Asisa VRT'!D17*150000/1000","v":73.893984375000002},{"$f":"'Tasas imp.incl. Asisa VRT'!E17*150000/1000","v":73.893984375000002}]
[26,{"$f":"'Tasas imp.incl. Asisa VRT'!B18*150000/1000","v":74.999156582054297},{"$f":"'Tasas imp.incl. Asisa VRT'!C18*150000/1000","v":43.886390625000004},{"$f":"'Tasas imp.incl. Asisa VRT'!D18*150000/1000","v":73.893984375000002},{"$f":"'Tasas imp.incl. Asisa VRT'!E18*150000/1000","v":73.893984375000002}]
[27,{"$f":"'Tasas imp.incl. Asisa VRT'!B19*150000/1000","v":72.897685837499992},{"$f":"'Tasas imp.incl. Asisa VRT'!C19*150000/1000","v":43.886390625000004},{"$f":"'Tasas imp.incl. Asisa VRT'!D19*150000/1000","v":73.893984375000002},{"$f":"'Tasas imp.incl. Asisa VRT'!E19*150000/1000","v":73.893984375000002}]
[28,{"$f":"'Tasas imp.incl. Asisa VRT'!B20*150000/1000","v":70.28173561476855},{"$f":"'Tasas imp.incl. Asisa VRT'!C20*150000/1000","v":43.886390625000004},{"$f":"'Tasas imp.incl. Asisa VRT'!D20*150000/1000","v":73.893984375000002},{"$f":"'Tasas imp.incl. Asisa VRT'!E20*150000/1000","v":73.893984375000002}]
{"$rows_left_out":52}
{"sheet":"Recargos por fracc","index":13,"n_rows":4,"n_cols":2,"rows_kept":4,"cut":false,"hidden":true,"merged":[]}
["Anual",0]
["Semestral",0.01]
["Trimestral",0.02]
["Mensual",0.03]